studyid,ihds1,ZCFT,ZCOWAT,vfef_Zcombo,ZDETlmn,ZIDNlmn,ZONBacc,ZONBlmn,ZOCLacc,ZGMLter,ZGMRter,ZISLcor,ZISRLcor,speed_Zcombo,attwm_Zcombo,maze_Zcombo,list_Zcombo,edu_years,hibp_bl,diabetes,hyperchol,myoc_infarct,angina,countryschool,firstlang,hivstatus,blmridate,blmridone,blmritime,blsbp,bldbp,blcd4,blcd4p,blcd4date,blvl,blvldate,glucose,glucdate,tchol,lipidsdate,trig,hdl,ldl,age,bllogvl,hivdiagyears,infectyears,syphcode,syphyear,hcvcode,blmritext,blmricode,ethcat,meanCBFLCN_rreg,sliceLCN_rreg,meanCBFLLN_rreg,sliceLLN_rreg,meanCBFRCN_rreg,sliceRCN_rreg,meanCBFRLN_rreg,sliceRLN_rreg,totalarea_rreg,meanCBFall_rreg,CNarea_rreg,meanCBF_CN_rreg,LNarea_rreg,meanCBF_LN_rreg,qc_cbf,qc_r1,qc_abv,qc_att,qc_total,qc_artefact,qc_combined,meanATT1LCN,meanATT1LLN,meanATT1RCN,meanATT1RLN,areaLCN,meanATT2LCN,areaLLN,meanATT2LLN,areaRCN,meanATT2RCN,areaRLN,meanATT2RLN,meanMVTTLCN,meanMVTTRCN,meanMVTTLLN,meanMVTTRLN,totalarea,meanATT1all,meanATT2all,meanMVTTall,CNarea,meanATT1_CN,meanATT2_CN,meanMVTT_CN,LNarea,meanATT1_LN,meanATT2_LN,meanMVTT_LN,any_cvd,lastsmoke,smoker,smokingyears,alc_cage,lastalc,alc_units,lastcaf,caffnum,caffamt,lastdrugs,ivdu,stim_drugs,degree,postgrad,manageprof,employment,base_needs
0001,12,-.1666666,-1.0752687,-.62096769,.19786815,.63903099,1.9227518,.99366462,,.64306307,-.1757576,1.8182818,1.5673766,.41844958,.99366462,.23365274,1.6928291,Postgrad,0,0,0,0,0,South Africa,Afrikaans,Positive,06jul2012,Yes,16,137,90,820,26.2,22mar2012,3800,22mar2012,,,,,,,,34.299999,3.5797837,4.454483,4.5119781,Never had syphilis,,HCV negative,normal intracranial appearances,Normal,White Other,36.715,4,54.306999,3,33.831001,4,52.917999,3,1701.563,47.50705,562.5,35.056698,1139.063,53.655369,5,6,2,3,16,7,23,.36899999,.234,.345,.18700001,239.062,.78500003,604.68799,.671,323.43799,.70200002,534.375,.58499998,.41600004,.35700002,.43700001,.39799997,1701.563,.25930578,.66590077,.40659505,562.5,.35519999,.73727494,.38207498,1139.063,.21195063,.63065434,.41870371,0,Never,Non-smoker,0,0,>72 hours,11.25,<12 hours,6.25,1225,>72 hours,Never,0,1,1,1,Full time,Always covered
0003,,-1.4629629,.75268817,-.35513735,,,,,,.62784129,.60025066,,,,,.61404598,,Postgrad,0,0,0,0,0,UK,English,Negative,02jul2012,Yes,13,146,96,,,,,,,,,,,,,64.400002,,,,Never had syphilis,,HCV negative,Grossly normal intracranial appearances,Normal,White Brit,29.606001,3,66.858002,3,41.122002,3,57.291,3,1139.062,51.25098,450,35.723862,689.06201,61.391144,1,6,1,1,9,4,13,.30000001,.333,.34799999,.382,210.938,.79299998,295.31201,.78500003,239.062,.83200002,393.75,.75199997,.49299997,.48400003,.45200002,.36999997,1139.062,.3469753,.78493822,.43796295,450,.32549995,.81371868,.48821875,689.06201,.36100003,.76614285,.40514281,0,>2 weeks,Ex-smoker,15,1,12-72 hours,75.074997,12-72 hours,17.5,3500,>72 hours,Never,0,1,1,1,Full time,Always covered
0004,,-.1666666,-1.0752687,-.62096769,.15751156,-.95543838,1.2941304,.5365774,,1.2905142,.21616168,-2.2429469,-1.329608,-.39896339,.5365774,.75333798,-1.7862774,Postgrad,0,0,0,0,0,Canada,English and French,Positive,30oct2012,Yes,14,,,280,13.5,15oct2012,210000,15oct2012,3.7,05nov2012,5,28jan2013,1.5,1.2,3.1,48.700001,5.3222194,1.393566,1.5003422,Acute syphilis during study,2013,HCV negative,normal intracranial appearances,Normal,White Other,49.026001,3,67.967003,2,32.939999,3,59.263,2,1476.562,57.96743,379.68701,40.685097,1096.875,63.949772,4,6,4,4,18,7,25,.322,.15700001,.23999999,.152,182.812,.69499999,590.625,.54500002,196.875,.57999998,506.25,.51599997,.373,.33999997,.38800001,.36399996,1476.562,.1867809,.55829513,.37151426,379.68701,.27948141,.63537025,.35588884,1096.875,.15469231,.53161538,.37692308,0,Never,Non-smoker,0,1,12-72 hours,10,<12 hours,42,8400,>72 hours,Previous,1,1,1,1,Full time,Always covered
0005,,.94444448,1.6489363,1.2966903,.59566104,.91043085,.33285969,1.1227878,,.64306307,.076767653,2.2327218,2.3249943,.75304592,1.1227878,.35991538,2.2788582,Secondary,0,0,0,0,0,USA,English,Negative,13aug2012,Yes,14,135,73,,,,,,,,,,,,,33.700001,,,,Never had syphilis,,NK,normal intracranial appearances,Normal,White Other,44.390999,4,39.993,4,41.243999,4,31.83,4,1392.188,37.887062,393.75,43.042282,998.43799,35.854015,2,6,3,3,14,3,17,.27599999,.134,.36899999,.113,225,.62400001,492.18799,.419,168.75,.58700001,506.25,.39500001,.34800002,.21800002,.285,.28200001,1392.188,.17779797,.46376768,.28596967,393.75,.31585714,.60814291,.29228574,998.43799,.12335212,.40683097,.28347886,0,>2 weeks,Ex-smoker,10,0,<12 hours,16.25,<12 hours,9,1800,<72 hours,Previous,0,0,0,1,Full time,Always covered
0006,11,1.3148148,1.5053763,1.4100956,.83089763,.49796137,1.6379606,.63122487,,1.262762,.93441939,1.3295685,-.10983773,.66442949,.63122487,1.0985906,.60986537,Univ.,0,0,0,0,0,UK,English,Positive,18jul2012,Yes,15,,,250,16.6,13mar2012,25000,13mar2012,4.7,13mar2012,4.1,18jun2010,2.6,1.3,.5,52.599998,4.3979402,4.4106774,,Never had syphilis,,HCV negative,"Few T2 hyperintense foci in white matter of bilateral hemispheres, within normal limits",Small WM foci,White Brit,25.278,4,40.223999,4,46.527,4,43.507999,4,1335.939,39.72435,520.31299,36.189659,815.62598,41.97924,0,6,1,0,7,3,10,.43900001,.43000001,.285,.333,253.125,.98500001,379.68799,.954,267.18799,.81400001,435.93799,.81099999,.546,.52900004,.52399999,.47799999,1335.939,.37105262,.88521045,.51415789,520.31299,.35991883,.89718914,.53727031,815.62598,.3781552,.87756902,.49941379,0,24hr - 2wk,Light smoker (1-10),36,0,12-72 hours,25,<12 hours,24.5,3920,>72 hours,Never,0,1,0,1,Part time,Always covered
0009,11,1.8703704,1.6129032,1.7416368,-2.1147723,-1.9744126,-1.79895,-3.0386412,,-.79837841,-2.70101,1.8178145,1.2498381,-2.0445924,-3.0386412,-1.7496942,1.5338264,Univ.,0,0,0,0,0,UK,English,Positive,16jul2012,Yes,14,107.5,70,450,20.7,12jun2012,17000,08jul2011,4,25sep2012,3.3,06mar2013,2.1,.9,1.4,33.900002,4.2304487,2.2340863,,Never had syphilis,,Chronic HCV,No abnormal findings,Normal,White Brit,41.655998,3,42.797001,2,30.709999,3,33.363998,2,1560.937,37.654621,379.68701,35.980289,1181.25,38.192802,1,6,2,1,10,4,14,.22400001,.07,.183,.068000004,182.812,.60000002,604.68799,.479,196.875,.55299997,576.56201,.37200001,.37600002,.36999997,.40900001,.30400002,1560.937,.10154951,.46298197,.36143243,379.68701,.2027407,.57562959,.37288886,1181.25,.06902381,.42677385,.35775003,0,<4 hr,Heavy smoker 10+,17,0,12-72 hours,10,<12 hours,22.75,3675,>72 hours,Past 3 months,1,1,0,1,Full time,Always covered
0010,,.38888896,-1.1827956,-.39695334,-.067596763,-.33059916,.3289178,.037559118,,1.0688829,.88956237,2.5223455,1.5662118,-.19909796,.037559118,.97922266,2.0442786,Univ.,0,0,1,0,0,Not stated,Bulgarian,Negative,13aug2012,Yes,13,142,91.5,,,,,,,,,,,,,36.900002,,,,Never had syphilis,,NK,normal intracranial appearances,Normal,White Other,36.678001,5,42.897999,4,36.148998,5,45.323002,4,1293.751,41.589138,407.81299,36.404381,885.93799,43.975777,4,6,5,5,20,6,26,.336,.199,.34200001,.171,196.875,.86900002,492.18799,.50300002,210.938,.903,393.75,.472,.53299999,.56099999,.30400002,.301,1293.751,.23464134,.61447835,.37983701,407.81299,.33910349,.88658631,.54748279,885.93799,.18655558,.48922226,.30266669,1,4hr - 24hr,Heavy smoker 10+,18,0,12-72 hours,6,12-72 hours,17,3400,>72 hours,Never,1,1,0,0,Full time,Always covered
0011,,1.5,1.6129032,1.5564516,.97901899,.29826257,1.2941304,1.4056131,,1.1132092,1.0579125,1.8127923,1.329608,.63864076,1.4056131,1.0855608,1.5712001,Postgrad,0,0,0,0,0,UK,English,Negative,24aug2012,Yes,13,122,73,,,,,,,,,,,,,34,,,,Never had syphilis,,NK,No abnormal findings,Normal,White Brit,55.181999,4,53.991001,4,36.805,4,42.096001,4,1560.936,47.640556,421.87399,44.768368,1139.062,48.704327,5,6,6,3,20,7,27,.199,.168,.25299999,.17299999,182.812,.59299999,632.81201,.47,239.062,.58099997,506.25,.45300001,.39399999,.32799998,.30199999,.28000003,1560.936,.18627024,.49589184,.3096216,421.87399,.22960001,.5862,.35659999,1139.062,.17022222,.46244442,.2922222,0,Never,Non-smoker,0,0,Never,0,12-72 hours,3.25,540,Never,Never,0,1,1,1,Full time,Always covered
0012,,-.53703696,1.3297873,.39637515,1.2046071,-.52696991,-.47694507,-.21248573,,.22264265,.076767653,1.145999,.84667414,.33881861,-.21248573,.14970514,.99633658,Secondary,0,0,0,0,0,UK,English,Negative,15aug2012,Yes,14,106,69,,,,,,,,,,,,,23.4,,,,Never had syphilis,,NK,normal intracranial appearances,Normal,White Other,44.099998,5,63.748001,4,44.074001,5,41.507999,4,1898.438,48.931473,492.18799,44.08886,1406.25,50.626389,3,6,5,3,17,4,21,.38100001,.25799999,.391,.236,281.25,.83600003,576.56201,.59799999,210.938,.83999997,829.68799,.64399999,.45500001,.44899997,.34,.40799999,1898.438,.28138521,.6802519,.39886665,492.18799,.38528574,.83771431,.45242855,1406.25,.24501999,.62514001,.38012001,0,24hr - 2wk,Light smoker (1-10),7,1,>72 hours,9,>72 hours,.75,125,>72 hours,Never,1,0,0,0,Unemployed,Always covered
0014,,.57407415,1.6129032,1.0934887,-1.8207306,-1.7354989,-1.5174072,-1.1239526,,-.6598404,.21616168,.33797804,.44320264,-1.7781148,-1.1239526,-.22183937,.39059034,Postgrad,0,0,0,0,0,UK,English,Negative,13sep2012,Yes,15,132,80.5,,,,,,4.7,19may2011,5,19may2011,.8,1.4,3.2,40.5,,,,Never had syphilis,,HCV negative,No abnormal findings,Normal,White Brit,64.321999,3,44.325001,2,56.691002,3,57.629002,2,1223.438,54.338547,393.75,60.233959,829.68799,51.540722,1,5,3,0,9,3,12,.233,.191,.20100001,.199,182.812,.63499999,379.68799,.66299999,210.938,.57999998,450,.588,.40200001,.37899998,.472,.389,1223.438,.20194252,.61691958,.41497704,393.75,.2158571,.60553563,.38967851,829.68799,.19533898,.62232202,.42698312,0,Never,Non-smoker,0,0,>72 hours,10,<12 hours,7,1400,Never,Never,0,1,1,1,Full time,Mostly covered
0017,,-.72222215,.64516127,-.038530439,.50837576,-.19546473,1.2687865,.39159125,,.52294296,-.42828286,.21813755,.60739797,.15645552,.39159125,.047330052,.41276777,Univ.,0,0,0,0,0,Greece / UK,Greek,Negative,10sep2012,Yes,13,120,71.5,,,,,,,,,,,,,32.799999,,,,Never had syphilis,,NK,normal intracranial appearances,Normal,White Other,55.903999,4,73.472,3,49.608002,4,63.858002,3,1617.187,63.810188,506.25,52.756004,1110.937,68.847542,4,6,5,2,17,6,23,.25299999,.109,.271,.11,253.125,.58099997,576.56201,.46000001,253.125,.676,534.375,.491,.32799998,.405,.35100001,.38099998,1617.187,.1572261,.5229913,.36576521,506.25,.26200002,.62849993,.36649999,1110.937,.10948101,.47491142,.36543038,0,4hr - 24hr,Heavy smoker 10+,14,0,12-72 hours,11.25,12-72 hours,14,2800,Never,Never,0,1,0,1,Full time,Always covered
0018,8,-1.6481481,-2.0430107,-1.8455794,.89557618,-1.2676817,.059302259,-1.2165982,,.70312315,.32929289,-.5454849,.16214237,-.18605277,-1.2165982,.51620805,-.19167127,Postgrad,0,0,0,0,0,Portugal,Portuguese,Positive,22aug2012,Yes,16,,,460,49.3,23aug2012,22000,23aug2012,4.9,11oct2012,4.6,11oct2012,.7,1.6,2.7,33.5,4.3424225,1.9767283,2.0616016,Never had syphilis,,HCV negative,normal intracranial appearances,Normal,White Other,53.624001,4,66.518997,3,41.143002,4,50.026001,3,1504.688,53.67812,520.31299,47.214836,984.375,57.094429,6,6,6,5,23,8,31,.38499999,.189,.35800001,.20299999,253.125,.69300002,421.875,.491,267.18799,.80500001,562.5,.61500001,.30800003,.447,.30199999,.412,1504.688,.25721499,.62709349,.3698785,520.31299,.37113515,.75051355,.37937847,984.375,.197,.56185716,.36485714,0,Never,Non-smoker,0,0,>72 hours,1.25,12-72 hours,3.5,640,>72 hours,Never,1,1,1,1,Full time,Always covered
0019,,-.90740734,-1.3978494,-1.1526284,-1.8749481,-.8768748,.59142679,-1.6152753,,.94336337,1.0868686,-.072731562,.16214237,-1.3759115,-1.6152753,1.015116,.044705402,Postgrad,0,0,0,0,0,Germany,German,Negative,22oct2012,Yes,14,127.5,86.5,,,,,,,,,,,,,33,,,,Never had syphilis,,NK,normal intracranial appearances,Normal,White Other,41.275002,3,64.061996,3,36.522999,3,59.103001,3,1420.312,54.227894,450,38.602001,970.31201,61.474693,5,6,3,2,16,8,24,.27700001,.185,.33000001,.222,196.875,.63200003,464.06201,.57099998,253.125,.74299997,506.25,.62800002,.35500002,.41299996,.38599998,.40600002,1420.312,.23678219,.63042575,.39364356,450,.30681249,.6944375,.38762498,970.31201,.20430437,.60073918,.39643478,0,>2 weeks,Ex-smoker,13,1,>72 hours,10,<12 hours,10.5,2100,>72 hours,Never,0,1,1,0,Part time,Sometimes covered
0029,,-.90740734,-1.9354838,-1.4214456,-1.8983433,-2.5240321,.21334015,-.54679334,,.28270271,.58181816,-1.7814585,-.67748231,-2.2111878,-.54679334,.43226045,-1.2294704,Univ.,0,0,0,0,1,Poland,Polish,Negative,19nov2012,Yes,9,149,79,,,,,,,,,,,,,28.9,,,,Never had syphilis,,NK,"Mild diffuse T2 hyperintense in bilateral white matter, esp deep parietal white matter",Diffuse WM signal,White Other,45.702,4,56.457001,3,47.554001,4,51.784,3,1490.626,51.911812,421.87601,46.627998,1068.75,53.997528,5,6,5,2,18,6,24,,,,,210.938,.85299999,506.25,.56599998,210.938,.68199998,562.5,.551,,,,,1490.626,,.61736804,,421.87601,,.76749998,,1068.75,,.55810523,,1,24hr - 2wk,Light smoker (1-10),12,1,>72 hours,25.5,12-72 hours,14.25,2840,Never,Never,0,1,0,0,Full time,Mostly covered
0030,12,2.2407408,1.5053763,1.8730586,.38368693,-.18336779,.16781394,.043192815,,1.4234929,1.562963,-.39942911,-.88640529,.10015957,.043192815,1.493228,-.64291722,Postgrad,0,0,0,0,0,UK,English,Positive,28nov2012,Yes,15,147,79,820,20.7,14sep2012,200000,14sep2012,4.7,14sep2012,3.4,11apr2011,1.2,1.1,1.8,38,5.3010302,.90349078,1.2895278,Never had syphilis,,Acute HCV during study,"Mild volume loss, otherwise normal intracranial appearances",Volume loss,White Brit,21.757999,4,29.257999,3,35.623001,4,34.766998,3,1476.563,30.999207,450,28.257235,1026.563,32.201164,3,6,1,0,10,6,16,.16599999,.229,.25299999,.214,239.062,.509,478.125,.57800001,210.938,.68599999,548.43799,.611,.34299999,.433,.34900001,.39700001,1476.563,.21665718,.59451437,.37785718,450,.20678134,.59196895,.3851876,1026.563,.22098629,.59563017,.37464386,0,>2 weeks,Ex-smoker,11,0,12-72 hours,9.5,<12 hours,12.25,2275,>72 hours,Past 3 months,1,1,1,1,Full time,Always covered
0032,12,-.53703696,.10752688,-.21475504,-.89503706,.012589712,.59142679,.40083897,,.46288288,-.1757576,.40002176,.16214237,-.44122368,.40083897,.14356264,.28108206,Postgrad,0,0,0,0,0,South Africa,English,Positive,06dec2012,Yes,16,126,81,630,40.1,04oct2012,970,02feb2012,4.4,27mar2013,5.1,27mar2013,1.3,1.2,3.3,32.099998,2.9867718,2.3928816,,Never had syphilis,,HCV negative,normal intracranial appearances,Normal,White Other,12.398,4,38.818001,3,38.59,4,36.941002,3,1631.252,34.733212,478.12598,27.034702,1153.126,37.925282,3,6,3,1,13,3,16,.234,.237,.271,.29899999,210.938,.73799998,604.68799,.74199998,267.18799,.755,548.43799,.69400001,.50399995,.484,.505,.39500001,1631.252,.26302585,.72747415,.4644483,478.12598,.25467649,.7475,.49282351,1153.126,.26648781,.71917069,.45268291,0,>2 weeks,Ex-smoker,5,0,12-72 hours,15,<12 hours,21,4200,>72 hours,Never,1,1,1,0,Part time,Always covered
0033,12,.75925934,.75268817,.75597376,.34882179,-.75070715,1.2687865,.4943915,-2.0175354,-.017597597,-.68080813,1.017976,-1.3199224,-.20094268,-.761572,-.34920287,-.1509732,Univ.,0,0,0,0,0,UK,English,Positive,21feb2013,Yes,9,118,86,400,29.7,18feb2013,32000,21sep2012,6.2,03jul2012,,,,,,23.4,4.5051498,1.3661876,1.7741274,Never had syphilis,,HCV negative,No abnormal findings,Normal,White Brit,53.806999,5,51.715,5,54.292,5,46.835999,5,1293.751,51.103378,478.12598,54.07803,815.625,49.359615,6,6,3,3,18,6,24,.27399999,.145,.21600001,.134,210.938,.59200001,421.875,.472,267.18799,.53899997,393.75,.412,.31800002,.32299995,.32700002,.278,1293.751,.17734788,.48714137,.30979347,478.12598,.24158825,.56238234,.32079411,815.625,.13968965,.4430345,.30334485,0,4hr - 24hr,Heavy smoker 10+,4,1,>72 hours,20,12-72 hours,36.75,7140,>72 hours,Never,0,1,0,0,Full time,Always covered
0034,11,-.72222215,-.05319149,-.38770682,-2.4176552,-1.3473455,.76557285,-.84398419,,-.5150159,-.15162903,-2.6727152,-2.4728916,-1.8825004,-.84398419,-.33332247,-2.5728035,Secondary,0,0,0,0,0,UK,English,Positive,13dec2012,Yes,16,120,80,1010,35.3,08nov2012,200000,08nov2012,5,08nov2012,,,,,,59.900002,5.3010302,.15879534,.32854208,Never had syphilis,,HCV negative,Mild-mod volume loss,Volume loss,White Brit,36.282001,4,65.795998,3,29.118,4,31.575001,3,1378.125,43.718876,421.875,32.461201,956.25,48.685497,3,6,3,4,16,6,22,.15700001,.13600001,.249,.189,196.875,.53399998,478.125,.52100003,225,.74800003,478.125,.54000002,.37699997,.49900001,.38500002,.35100001,1378.125,.17583673,.5665102,.39067346,421.875,.20606665,.64813334,.4420667,956.25,.16249999,.53050005,.368,0,24hr - 2wk,Light smoker (1-10),42,1,12-72 hours,56.450001,12-72 hours,105,19600,>72 hours,Never,0,0,0,0,Retired,Always covered
0035,,,,,,,,,,,,,,,,,,,0,0,0,0,0,UK,English,Positive,03dec2012,Yes,16,135,82,570,30.3,02oct2012,16000,02oct2012,6.2,22jun2011,,,,,,31,4.2041202,1.4702259,1.8836414,Never had syphilis,,HCV negative,normal intracranial appearances,Normal,White Brit,45.962002,3,63.188,3,30.362,3,47.794998,3,1392.188,49.595001,492.18799,37.493423,900,56.213055,5,6,5,3,19,7,26,.32800001,.25299999,.324,.26300001,225,.83200002,492.18799,.727,267.18799,.86799997,407.81201,.69599998,.50400001,.54399997,.47400001,.43299997,1392.188,.28167677,.76194954,.48027274,492.18799,.32582858,.85154283,.52571428,900,.25753126,.71295315,.45542189,0,Never,Non-smoker,0,0,>72 hours,1.25,>72 hours,7.75,1255,>72 hours,Previous,0,1,0,1,Full time,Always covered
0038,11,-.53703696,-.05319149,-.29511422,-.8579722,-1.9415084,-.13433771,-1.7760156,,-.21657801,.047811516,-.64899045,-.17797405,-1.3997403,-1.7760156,-.084383249,-.41348225,Secondary,,,,,,,,Negative,,No,,147,106,,,,,,,,,,,,,47.5,,,,NK,,NK,Not scanned,Not done,White Other,,,,,,,,,,,,,,,,,,,,,,,,,,,,,,,,,,,,,,,,,,,,,,,,,,0,,,31,,,0,,0,0,,Never,0,0,0,,0,NK
0039,,-2.3888888,-1.8279569,-2.1084228,-2.3410492,-3.3799198,-.5224371,-1.4556781,,-.85843843,-1.6909091,.21813755,-.035042156,-2.8604846,-1.4556781,-1.2746738,.091547698,Univ.,0,0,0,0,0,"Brazil, UK",Portuguese,Negative,27mar2013,Yes,16,138,72,,,,,,,,,,,,,27.9,,,,Never had syphilis,,NK,No abnormal findings,Normal,White Other,52.923,2,77.818001,1,51.729,2,64.426003,1,1575,64.511848,548.43799,52.310696,1026.562,71.030281,6,6,4,3,19,8,27,.104,.068000004,.109,.044,267.18799,.47099999,506.25,.32499999,281.25,.49000001,520.31201,.35100001,.36699998,.38100001,.25699997,.30700001,1575,.073500022,.38782147,.31432146,548.43799,.1065641,.48074353,.37417945,1026.562,.055835627,.33817807,.28234246,0,24hr - 2wk,Light smoker (1-10),11,0,12-72 hours,15,<12 hours,17.5,3500,>72 hours,Never,1,1,0,1,Full time,Mostly covered
0040,,-1.2777777,-.10752688,-.69265229,.8123883,.84716165,1.2941304,.69769901,,1.1132092,.88956237,2.9189031,.88640529,.82977498,.69769901,1.0013858,1.9026542,Postgrad,0,0,0,0,0,UK,English,Negative,11feb2013,Yes,16,126,84,,,,,,,,,,,,,37.299999,,,,Never had syphilis,,HCV negative,normal intracranial appearances,Normal,White Brit,48.674999,4,60.533001,4,43.048,4,50.967999,4,1518.75,52.093899,534.37598,45.8615,984.37402,55.477215,3,6,6,3,18,7,25,.472,.257,.44499999,.237,267.18799,1.017,464.06201,.61400002,267.18799,1.041,520.31201,.65899998,.54499996,.59600002,.35700002,.42199999,1518.75,.32104644,.77543545,.45438898,534.37598,.4585,1.0289999,.57049996,984.37402,.24642856,.63778573,.39135715,0,24hr - 2wk,Light smoker (1-10),14,0,12-72 hours,15,<12 hours,15,2400,Never,Never,0,1,1,1,Full time,Always covered
0041,11,-1.6481481,-2.2580645,-1.9531063,.3885662,-1.5475247,-.28236964,-.68733704,-1.4714637,.0050531914,-.12053865,-1.5055398,-1.7728106,-.57947922,-1.0794003,-.05774273,-1.6391752,Postgrad,0,0,0,0,1,(left blank),Polish,Positive,04mar2013,Yes,15,122,71,830,28.1,08jan2013,270,24sep2012,,,,,,,,42.700001,2.4313638,5.1718001,,Never had syphilis,,HCV negative,Infarct in (R) inf parietal & post (R) insular cortex; mild SVD,Infarct,White Other,57.324001,2,55.983002,2,45.806,2,51.694,2,1448.437,53.207649,464.06201,51.739506,984.375,53.899769,1,6,2,2,11,4,15,.33500001,.23999999,.29899999,.226,239.062,.898,506.25,.63599998,225,.74699998,478.125,.59600002,.56299996,.44799998,.39599997,.37,1448.437,.26022327,.68328142,.42305818,464.06201,.31754544,.8247878,.50724238,984.375,.2332,.61657143,.38337141,1,Never,Non-smoker,0,0,>72 hours,2.5,12-72 hours,.25,40,Never,Never,0,1,1,0,Unemployed,Always covered
0043,12,2.425926,0,1.212963,-.06450665,-1.0044183,1.2687865,-.80426556,-2.4905069,.22264265,.58181816,-.18178168,-1.3199224,-.53446245,-1.6473862,.40223041,-.75085205,Univ.,0,0,0,0,0,"UK, Germany",English,Positive,24apr2013,Yes,9,124,69,670,35.3,28feb2013,300,28feb2013,4.8,13may2013,,,,,,33,2.4771214,.39698836,.47912389,Previous syphilis,2012,HCV negative,No abnormal findings,Normal,Indian,62.799999,3,72.235001,2,54.075001,3,76.288002,2,1364.061,68.777626,478.12399,58.4375,885.93701,74.357994,3,6,3,3,15,3,18,.19400001,.037,.156,.052999999,239.062,.55699998,421.875,.384,239.062,.65899998,464.06201,.389,.36299998,.50299996,.347,.336,1364.061,.090814382,.46421638,.37340203,478.12399,.175,.60800004,.43299997,885.93701,.045380946,.38661906,.34123811,0,Never,Non-smoker,0,0,Never,0,12-72 hours,1.5,290,Never,Never,0,1,0,1,Full time,Always covered
0044,12,1.5,1.1827956,1.3413978,-.52238673,-.27842438,1.4991108,-.30714574,-.77595836,1.0688829,1.0579125,2.5223455,1.5662118,-.40040556,-.54155207,1.0633976,2.0442786,Univ.,0,0,0,0,0,South Africa,"English, Afrikaans",Positive,08mar2013,Yes,12,126,97,810,25.6,03jan2013,250000,03jan2013,4.6,11dec2012,4.8,11dec2012,1.1,1,3.3,38.900002,5.3979402,15.394935,16.56126,Never had syphilis,,HCV negative,Diffuse bilateral white matter signal abnormality,Diffuse WM signal,White Other,30.844,2,33.823002,1,37.979,2,39.308998,1,1504.686,35.83543,576.56201,35.194607,928.12402,36.233513,0,6,2,3,11,5,16,.20299999,.068000004,.223,.105,225,.722,520.31201,.44600001,351.56201,.722,407.81201,.31200001,.51899999,.49900001,.37800002,.20700002,1504.686,.13442992,.51543927,.38100937,576.56201,.21519512,.722,.50680488,928.12402,.084257573,.38712123,.30286366,0,Never,Non-smoker,0,0,>72 hours,2.25,12-72 hours,2.25,420,>72 hours,Never,0,1,0,1,Full time,Always covered
0050,,,,,-.23616666,-.47466999,-.13880301,-.52918935,-1.7439371,1.6451241,1.3946128,-1.7998643,-1.7069948,-.35541832,-1.1365633,1.5198684,-1.7534295,Univ.,0,0,0,0,.a,Argentina,Spanish,Positive,05mar2013,Yes,15,124,78,510,16.4,02jan2013,510,02jan2013,4.6,02jan2013,4.3,02jan2013,1.1,1.3,2.5,44,2.7075701,10.721424,,Previous syphilis,2008,HCV negative,Diffuse bilateral white matter signal abnormality,Diffuse WM signal,White Other,57.564999,2,66.911003,1,40.84,2,57.648998,1,1589.063,58.254066,478.12598,48.218678,1110.937,62.573109,3,5,2,3,13,5,18,.27599999,.11,.30700001,.15700001,210.938,.67699999,590.625,.46700001,267.18799,.583,520.31201,.45699999,.40099999,.27599999,.35699999,.29999998,1589.063,.18054876,.51110625,.33055753,478.12598,.29332355,.62447059,.33114707,1110.937,.13201265,.46231642,.33030379,0,24hr - 2wk,Light smoker (1-10),27,0,>72 hours,10,<12 hours,17.5,3500,Never,Never,0,1,0,0,Full time,Sometimes covered
0051,12,1.3148148,1.1827956,1.2488053,-.61887312,-2.2165053,-.61736864,.2579236,-1.6096209,-.70416665,-.28888881,2.9189031,0,-1.4176892,-.67584866,-.49652773,1.4594516,Postgrad,0,0,0,0,0,UK,English,Positive,11mar2013,Yes,16,145,88,490,22.2,25feb2013,110000,25feb2013,5.7,14aug2012,4.4,26sep2011,1.7,1.4,2.2,45.400002,5.0413928,1.1471595,1.2375085,Never had syphilis,,HCV negative,No abnormal findings,Normal,White Brit,45.172001,1,50.424,1,95.582001,1,87.650002,1,1279.687,69.011215,492.18701,71.097168,787.5,67.707497,5,6,3,3,17,5,23,.18099999,.114,.024,.003,239.062,.40799999,421.875,.37400001,253.125,.19400001,365.625,.164,.227,.17,.26000002,.161,1279.687,.076999962,.28474721,.20774724,492.18701,.10025706,.29794273,.19768567,787.5,.062464286,.27649999,.21403572,0,24hr - 2wk,Light smoker (1-10),28,1,12-72 hours,25,<12 hours,2.5,410,>72 hours,Never,1,1,1,1,Other,Not covered